Probate due to Financial Exploitation
type: Class
alternative label: 因财务剥削而产生的遗产清算
subclass of: RCZqMfCIxpgPzceI6IC42yK
definition: Probate due to Financial Exploitation: The legal process of distributing the assets of a deceased person who was financially exploited during their lifetime, as a reason for filing a probate case.