No Contact
type: Class
alternative label: 无联系
subclass of: R7p8xRy14cVNnXyHxD92nQk
definition: No Contact: A condition of a criminal disposition that prohibits any communication or physical contact between the offender and the victim or other specified individuals.