Curfew, Loitering, and Vagrancy Violations
type: Class
alternative label: 宵禁、徘徊和流浪违规行为
subclass of: RLvhxz3b1k2IU3MaAgeRtF
definition: The violation of a court order, regulation, ordinance, or law requiring the withdrawal of persons from the streets or other specified areas; prohibiting persons from remaining in an area or place in an idle or aimless manner; or prohibiting persons from going from place to place without visible means of support.