Nogai
type: Class
alternative label: 诺盖人
subclass of: RDOvAHsvY8TKJ1O1orXPM9o
definition: Nogai is a language that belongs to the Turkic language family and is spoken primarily in Russia and Kazakhstan.