04_3 Bankruptcy (PACER NoS)
type: Class
subclass of: RCSGywkPBv7f2ACrfTSiirV
definition: 04_3 Bankruptcy (PACER NoS) refers to the specific category within the PACER Nature of Suit (NoS) Codes that deals with bankruptcy cases filed in federal court.