Tortious Breach of Contract
type: Class
alternative label: 违约侵权
subclass of: RC2fjcpsEbrVvVymvt4oASx
definition: The Tortious Breach of Contract is a legal concept that occurs when one party breaches a contract and causes harm or damages to the other party, resulting in a tort claim in addition to a breach of contract claim.