Georgia District Court - Fulton County Magistrate Court
type: Class
subclass of: RBxw7BF15bDA0Ifn2vOrC8h
definition: A court located in Fulton County, Georgia that has limited jurisdiction over certain civil and criminal cases.