Quechua
type: Class
alternative label: 克丘亚语
subclass of: RDOvAHsvY8TKJ1O1orXPM9o
definition: Quechua is a structured system of communication, both written and spoken, that is used in certain regions of South America and is a member of the Language top-level class.