Estoppel by Deed
type: Class
alternative label: 契约禁言
subclass of: RoKNrz23ylFaWAaoPC3ECY
definition: A legal principle that prevents a party from denying the truth of a statement made in a deed or other legal document, when that party's previous actions or words have relied upon the truth of that statement.