Status Report
type: Class
alternative label: 状态报告
subclass of: R7P7kd5lf60cWlSHHwGsH5k
subclass of: R7zvYKadqTXgMZV8ghLsloR
definition: A status report is a written document that provides an update on the current state of a particular matter or situation, typically used in the context of legal proceedings.