Examination Under Oath
type: Class
alternative label: 宣誓作证审讯
subclass of: R7epmKzXnQGUjQ78UEKxoTG
definition: A formal proceeding often used by insurance companies to obtain information about a claim — usually before a suit is filed.