Discrimination Law
type: Class
alternative label: 歧视法
subclass of: R07tQM5sYugYGBPQS571s5
hidden label: DISC
definition: Protection from discrimination on grounds such as race, gender, sexual orientation, national origin, color, age, political affiliation, ethnicity, religion, and disability.