Promise to Appear
type: Class
alternative label: 出庭承诺
subclass of: R7zvYKadqTXgMZV8ghLsloR
definition: A Promise to Appear is a legal document filed in trial court practice that requires a defendant to appear in court at a specified time and date.