Minnesota District Court - Court of App.
type: Class
subclass of: RxLV9XEaDWbDIA8N1fl2fM
definition: Minnesota District Court - Court of App. is a specific court within the Minnesota District Court system that hears appeals from lower courts.