Dargwa
type: Class
alternative label: 达尔格瓦语
subclass of: RDOvAHsvY8TKJ1O1orXPM9o
definition: Dargwa is a language that belongs to the Language top-level class and is spoken in the North Caucasus region of Russia.