Sole Proprietorship
type: Class
alternative label: 独资企业
subclass of: R7oBWHStfmqTLn2MypkW3Pj
hidden label: SP
definition: A sole proprietorship, also known as the sole trader, individual entrepreneurship or proprietorship, is a type of enterprise that is owned and run by one person and in which there is no legal distinction between the owner and the business entity. The sole trader receives all profits (subject to taxation specific to the business) and has unlimited responsibility for all losses and debts. Every asset of the business is owned by the proprietor and all debts of the business are the proprietor's. It is a "sole" proprietorship in contrast with partnerships (which have at least two owners).