inv_currency
type: Class
subclass of: RHfeijrOTjaF7qpuoGIGkR
definition: "The currency for this invoice. Use ISO 4217 currency codes set forth by International Standards Organization (www.iso.org.). "