Chinese
type: Class
alternative label: 中文
subclass of: RDOvAHsvY8TKJ1O1orXPM9o
definition: Chinese (Language) is a structured system of communication consisting of grammar and vocabulary, used in legal matters as a means of document, artifact, evidence, testimony, proceeding, or any other legal aspect.