Indiana Superior Court - Floyd County
type: Class
subclass of: R7uq2Mq8qLUybQoDhVczzZ5
definition: Indiana Superior Court - Floyd County is a specific court within the Indiana Superior Court system that has jurisdiction over cases in Floyd County, Indiana.