08_3 Federal Tax Suits (PACER NoS)
type: Class
subclass of: RCSGywkPBv7f2ACrfTSiirV
definition: 08_3 Federal Tax Suits (PACER NoS) refers to a specific category of legal cases related to federal tax disputes, as classified by the PACER Nature of Suit (NoS) Codes.