Motion to Remand Case
type: Class
alternative label: 撤销案件移送申请
subclass of: R8zwKGkogGKIKWSVWb1ItRL
subclass of: RbAyL0ru5m8CyqAShGVq0e
definition: A Motion to Remand Case is a formal request made by a party in a legal case to send the case back to a lower court for further proceedings or reconsideration.