Order
type: Class
preferred label: Ruling
alternative label: 订单
subclass of: RDBXUrFP9mCZLCxzqy8nbEX
subclass of: Rjco9ohucVSJ0XxprM5Opb
definition: An Order, also known as a Ruling, is a written document issued by a trial court that directs parties to take certain actions or makes a decision on a specific matter in a legal case.