Miscellaneous Provisions Clause
type: Class
alternative label: 其他条款
subclass of: RDe0RKU39BlhcyACJW30ZLc
definition: A Miscellaneous Provisions Clause is a contractual clause that includes additional terms and conditions that are not covered by other clauses in the contract.