"Intervening Event" Language
type: Class
alternative label: 干预事件
subclass of: RCZmEz3VSzAcKpjGH5Wu1ir
definition: Intervening Event Language refers to the specific language used to describe a triggering event that causes a change in recommendation in a legal matter, such as a breach or violation of fiduciary duties.