Leveraged Buyout
type: Class
preferred label: LBO
subclass of: R7Rdvjz7Q76QLZXnSJ66z40
definition: A Leveraged Buyout (LBO) is a financial transaction where a company is acquired primarily using borrowed funds, often by taking on substantial debt. The assets of the company being acquired, and often those of the acquiring company, are used as collateral for the loans.
note: We're still thinking through which parent this has.