Interference with Prospective Business Relationship
type: Class
alternative label: 干扰预期商业关系
subclass of: RCXmZbkCGNYfkmZHX1WWCqW
definition: The Interference with Prospective Business Relationship is the intentional or negligent interference with a party's potential economic advantage by a third party, causing harm to the party's business relationship.