Response
type: Class
alternative label: 回答
subclass of: Rjco9ohucVSJ0XxprM5Opb
definition: A Response is a type of Litigation Document that is filed by a party in a legal case to answer or reply to a complaint or petition filed by the opposing party.