General / Summary Probate
type: Class
alternative label: 一般/摘要遗嘱认证
subclass of: R92ONqcV7UfNfi8C6GrarfD
definition: General/Summary Probate is a type of probate filing that is used for small estates with limited assets and straightforward distribution processes.