Motion to File Amended Proof of Claim
type: Class
alternative label: 提交修改后的索赔证明申请书
subclass of: R9Ii4OzSADsjS0VegX12oQJ
definition: A Motion to File Amended Proof of Claim is a request made in a bankruptcy case to modify or update a previously filed claim.