Motion to Consolidate for Trial
type: Class
alternative label: 合并审判动议
subclass of: R9Ii4OzSADsjS0VegX12oQJ
definition: A Motion to Consolidate for Trial is a request made in bankruptcy proceedings to combine two or more related cases into a single trial.