Rental and Leasing Services Industry
type: Class
alternative label: 租赁服务行业
subclass of: RjKL1UdfWL1FCPVhnbIFSF
hidden label: RELS
definition: Industries in this group include establishments that provide a wide array of tangible goods, such as automobiles, computers, consumer goods, and industrial machinery and equipment, to customers in return for a periodic rental or lease payment. thee include those that are engaged in renting consumer goods and equipment and those that are engaged in leasing machinery and equipment often used for business operations.