Food, Drug, and Cosmetic Act Claims
type: Class
alternative label: 食品、药品和化妆品法索赔
subclass of: R9LVBKjvGRuzwgtlhuLST36
definition: Claims made under the Food, Drug, and Cosmetic Act, which regulates the safety and labeling of food, drugs, and cosmetics.