07 Labor (PACER NoS)
type: Class
subclass of: RCSGywkPBv7f2ACrfTSiirV
definition: 07 Labor (PACER NoS) refers to a category of legal cases related to labor disputes, including issues such as fair labor standards, employee retirement benefits, and labor-management relations.