Impress a Trust
type: Class
alternative label: 给人留下信任的印象
subclass of: RWS7oVs9s2563KGt41Lsta
definition: To "Impress a Trust" means to create an equitable claim on property by demonstrating that it was intended to be held in trust, even if it was not formally declared as such.