Elements of Claim
type: Class
alternative label: 要素要求
subclass of: R9q7GJc1zsYT0P4Xdp6l9Oz
definition: Elements of Claim: The essential components that must be proven in a legal action in order to establish a valid claim, including but not limited to the specific facts, legal theories, and evidence necessary to support the claim.