Document / Artifact
type: Class
alternative label: 文档 / 工件
subclass of: Thing
definition: A written, drawn, presented, or memorialized representation of thought or expression, including evidence such as recordings and other artifacts.