Providing Alcohol to Intoxicated Adult
type: Class
alternative label: 向醉酒成年人提供酒精
subclass of: R7yue2mtjzJWKBkXpq5y1Mm
definition: Providing Alcohol to Intoxicated Adult: The act of giving or serving alcoholic beverages to an adult who is already intoxicated, which can result in legal liability for the provider.