Discount Amount - Fee
type: Class
alternative label: 折扣金额 - 费用
subclass of: RDa4bldOTcRUQoNUN6HpV97
definition: Discount Amount - Fee refers to a reduction in the fee charged for legal services provided, either as a percentage or a fixed amount.