Wagoner Rule
type: Class
alternative label: 瓦格纳规则
subclass of: RCzs34uEQI9f4cuWp3bQO0P
definition: The Wagoner Rule is a legal defense in civil litigation that prevents a trustee from suing third-party professionals for damages caused by the trustee's own misconduct.