Colorado River Abstention
type: Class
alternative label: कोलोराडो नदी संयम
subclass of: RuliWeVDE8CQi4AATMNab1
definition: A legal doctrine that allows federal courts to abstain from hearing cases that involve complex state water rights issues in the Colorado River Basin.