Rajasthani
type: Class
alternative label: 拉贾斯坦邦语
subclass of: RDOvAHsvY8TKJ1O1orXPM9o
definition: Rajasthani (Language) is a written or spoken structured system of communication that consists of grammar and vocabulary, specifically used in the region of Rajasthan, India.