firm segment
type: Class
subclass of: RC3hDYvR4ffxmqJg2F8YGT6
definition: "Information on the firm whose invoices have been submitted. There will be 1 or more FIRM segments per file. Allows for the submission of invoices for more than one firm in the same invoice file. Each file should begin with the FIRM segment. "