Eminent Domain
type: Class
alternative label: 征用
subclass of: RCvD6VheGrBYqJhgQDfMbrV
subclass of: RDSBerlLWg1ntpLqDQn1eVn
subclass of: RDr6DXAcukDYZgOiiRN8qtf
definition: The concept of Eminent Domain (Taking) refers to the power of the government to take private property for public use, with just compensation to the owner, as authorized by the Constitution.