oasis:LogicalFormula
type: Class
subclass of: R83spgNoduHRVfnLcxe6nO5
definition: A logical formula is a statement in legal language that expresses a relationship between different elements, such as conditions, actions, or outcomes, and is defined within the LegalXML OASIS SCHEMA.