Arkansas Circuit Court - Cleveland Cty.
type: Class
subclass of: RCEWWtS3nM8GE8R4en1abRz
definition: The Arkansas Circuit Court - Cleveland Cty. is a specific court within the Arkansas Circuit Court system that has jurisdiction over legal matters within Cleveland County, Arkansas.