Georgia Superior Court - Meriwether County
type: Class
subclass of: RCBE5bLTCIia7wAstjMsnKO
definition: A court of general jurisdiction in the state of Georgia, located in Meriwether County and presided over by a judge.