Port Authority Negligence
type: Class
alternative label: 港务局疏忽
subclass of: RCfunX4u69LUQ3gbhckE0oI
subclass of: RqHLQbqYW16CtZ6TSKOZPz
definition: Negligent actions or omissions by a port authority, which may result in harm or damage to individuals or property within the scope of admiralty and maritime claims.