Motion to Take Judicial Notice
type: Class
alternative label: 请求法院注意
subclass of: R8zwKGkogGKIKWSVWb1ItRL
subclass of: R9Ii4OzSADsjS0VegX12oQJ
subclass of: Roi2OUuh5i5gPUoKu8Jyuc
definition: A Motion to Take Judicial Notice is a formal request made to a court asking it to consider certain facts as true without requiring evidence to prove them.