COVID Ruleset
type: Class
alternative label: COVID规则集
subclass of: RCxXGBilObl1nMVRBrbmRRn
definition: A COVID Ruleset is a set of regulations and guidelines created in response to the COVID-19 pandemic, which outlines specific legal requirements and restrictions related to the virus.