Management of Companies and Enterprises Industry
type: Class
alternative label: 公司和企业管理行业
subclass of: RDIwFaFcH4KY0gwEY0QlMTp
hidden label: CMG
definition: This group comprises establishments that hold the securities of (or other equity interests in) companies and enterprises for the purpose of owning a controlling interest or influencing management decisions or establishments (except government establishments) that administer, oversee, and manage establishments of the company or enterprise and that normally undertake the strategic or organizational planning and decision making role of the company or enterprise.